Target
Muscarinic acetylcholine receptor M3
Ligand
BDBM50581185
Substrate
Meas. Tech.
ChEMBL_2150070 (CHEMBL5034532)
Ki
0.398±n/a nM
Target
Name:
Muscarinic acetylcholine receptor M3
Synonyms:
ACM3_HUMAN Cholinergic, muscarinic M3 Muscarinic receptor M3 | RecName: Full=Muscarinic acetylcholine receptor M3
Type:
Enzyme
Mol. Mass.:
66151.03
Organism:
Homo sapiens (Human)
Description:
P20309
Residue:
590
  
Inhibitor
Name:
BDBM50581185
Synonyms:
CHEMBL5076558
Type:
Small organic molecule
Emp. Form.:
C38H39Cl2N3O7
Mol. Mass.:
720.638
SMILES:
COc1ccc(cc1OC)[C@H](Cc1c(Cl)c[n+]([O-])cc1Cl)OC(=O)c1cccc(CNC(C(=O)O[C@H]2CN3CCC2CC3)c2ccccc2)c1
: