Target
Muscarinic acetylcholine receptor M3
Ligand
BDBM325621
Substrate
Meas. Tech.
ChEMBL_2150070 (CHEMBL5034532)
Ki
6.3±n/a nM
Target
Name:
Muscarinic acetylcholine receptor M3
Synonyms:
ACM3_HUMAN Cholinergic, muscarinic M3 Muscarinic receptor M3 | RecName: Full=Muscarinic acetylcholine receptor M3
Type:
Enzyme
Mol. Mass.:
66151.03
Organism:
Homo sapiens (Human)
Description:
P20309
Residue:
590
  
Inhibitor
Name:
BDBM325621
Synonyms:
US9636336, Example 11 US9636336, Example 66 | [(1S)-2-(3,5-dichloro-1-oxido-pyridin-1-ium-4-yl)-1-(3,4-dimethoxyphenyl)ethyl]5-[[[2-oxo-1-phenyl-2-[[(3R)-quinuclidin-3-yl]methoxy]ethyl]amino]methyl]thiophene-2-carboxylate
Type:
Small organic molecule
Emp. Form.:
C37H39Cl2N3O7S
Mol. Mass.:
740.692
SMILES:
COc1ccc(cc1OC)[C@H](Cc1c(Cl)c[n+]([O-])cc1Cl)OC(=O)c1ccc(CNC(C(=O)OC[C@H]2CN3CCC2CC3)c2ccccc2)s1
: