Target
Muscarinic acetylcholine receptor M2
Ligand
BDBM50581203
Substrate
Meas. Tech.
ChEMBL_2150084 (CHEMBL5034546)
Ki
0.199526±n/a nM
Target
Name:
Muscarinic acetylcholine receptor M2
Synonyms:
ACM2_HUMAN Cholinergic, muscarinic M2 Muscarinic acetylcholine receptor M2 and M5 | RecName: Full=Muscarinic acetylcholine receptor M2
Type:
GPCR
Mol. Mass.:
51730.61
Organism:
Homo sapiens (Human)
Description:
P08172
Residue:
466
  
Inhibitor
Name:
BDBM50581203
Synonyms:
CHEMBL5074599
Type:
Small organic molecule
Emp. Form.:
C36H37Cl2N3O7S
Mol. Mass.:
726.666
SMILES:
COc1ccc(cc1OC)[C@H](Cc1c(Cl)c[n+]([O-])cc1Cl)OC(=O)c1ccc(CNC(C(=O)O[C@H]2CN3CCC2CC3)c2ccccc2)s1
: