Target
Cruzipain
Ligand
BDBM50581364
Substrate
Meas. Tech.
ChEMBL_2150847 (CHEMBL5035309)
Ki
>100000±n/a nM
Citation
 Li, LChenna, BCYang, KSCole, TRGoodall, ZTGiardini, MMoghadamchargari, ZHernandez, EAGomez, JCalvet, CMBernatchez, JAMellott, DMZhu, JRademacher, AThomas, DBlankenship, LRDrelich, ALaganowsky, ATseng, CKLiu, WRWand, AJCruz-Reyes, JSiqueira-Neto, JLMeek, TD Self-Masked Aldehyde Inhibitors: A Novel Strategy for Inhibiting Cysteine Proteases. J Med Chem 64:11267-11287 (2021)  
Target
Name:
Cruzipain
Synonyms:
CYSP_TRYCR Cruzaine | Major cysteine proteinase
Type:
Protein
Mol. Mass.:
49831.41
Organism:
Trypanosoma cruzi
Description:
P25779
Residue:
467
  
Inhibitor
Name:
BDBM50581364
Synonyms:
CHEMBL5079046
Type:
Small organic molecule
Emp. Form.:
C25H32N4O3
Mol. Mass.:
436.5466
SMILES:
CN1CCN(CC1)C(=O)N[C@@H](Cc1ccccc1)C(=O)N[C@@H]1Cc2ccccc2C[C@H]1O
: