Target
ATP-binding cassette sub-family C member 3
Ligand
BDBM50581550
Substrate
Meas. Tech.
ChEMBL_2151402 (CHEMBL5035864)
IC50
22000±n/a nM
Target
Name:
ATP-binding cassette sub-family C member 3
Synonyms:
ABCC3 CMOAT2 MLP2 MRP3 Multi-specific organic anion transporter D | Multidrug resistance-associated protein 3
Type:
PROTEIN
Mol. Mass.:
169352.45
Organism:
Homo sapiens (Human)
Description:
ChEMBL_735421
Residue:
1527
  
Inhibitor
Name:
BDBM50581550
Synonyms:
AP-3152 FREE ACID Bms-986020
Type:
Small organic molecule
Emp. Form.:
C29H26N2O5
Mol. Mass.:
482.5271
SMILES:
C[C@@H](OC(=O)Nc1c(C)noc1-c1ccc(cc1)-c1ccc(cc1)C1(CC1)C(O)=O)c1ccccc1
: