Target
ATP-binding cassette sub-family C member 3
Ligand
BDBM50581551
Substrate
Meas. Tech.
ChEMBL_2151402 (CHEMBL5035864)
IC50
24000±n/a nM
Target
Name:
ATP-binding cassette sub-family C member 3
Synonyms:
ABCC3 CMOAT2 MLP2 MRP3 Multi-specific organic anion transporter D | Multidrug resistance-associated protein 3
Type:
PROTEIN
Mol. Mass.:
169352.45
Organism:
Homo sapiens (Human)
Description:
ChEMBL_735421
Residue:
1527
  
Inhibitor
Name:
BDBM50581551
Synonyms:
CHEMBL5072201
Type:
Small organic molecule
Emp. Form.:
C24H33N5O5
Mol. Mass.:
471.5493
SMILES:
CN(CC1CCC1)C(=O)OCc1c(nnn1C)-c1ccc(O[C@H]2CCC[C@@H](C2)C(O)=O)c(C)n1
: