Target
D(1A) dopamine receptor
Ligand
BDBM50149711
Substrate
Meas. Tech.
ChEMBL_303029 (CHEMBL830416)
Ki
600±n/a nM
Citation
 Hocke, CPrante, OLöber, SHübner, HGmeiner, PKuwert, T Synthesis and radioiodination of selective ligands for the dopamine D3 receptor subtype. Bioorg Med Chem Lett 14:3963-6 (2004)  
Target
Name:
D(1A) dopamine receptor
Synonyms:
DRD1 Dopamine D1 receptor
Type:
PROTEIN
Mol. Mass.:
49269.92
Organism:
Sus scrofa
Description:
ChEMBL_1460140
Residue:
446
  
Inhibitor
Name:
BDBM50149711
Synonyms:
5-Iodo-thiophene-2-carboxylic acid {4-[4-(2-methoxy-phenyl)-piperazin-1-yl]-butyl}-amide | CHEMBL182652
Type:
Small organic molecule
Emp. Form.:
C20H26IN3O2S
Mol. Mass.:
499.409
SMILES:
COc1ccccc1N1CCN(CCCCNC(=O)c2ccc(I)s2)CC1
: