Target
Flavin reductase (NADPH)
Ligand
BDBM50061625
Substrate
Meas. Tech.
ChEMBL_2153628 (CHEMBL5038175)
Kd
1380±n/a nM
Citation
 Kim, MHa, JHChoi, JKim, BRGapsys, VLee, KOJee, JGChakrabarti, KSde Groot, BLGriesinger, CRyu, KSLee, D Repositioning Food and Drug Administration-Approved Drugs for Inhibiting Biliverdin IX? Reductase B as a Novel Thrombocytopenia Therapeutic Target. J Med Chem 65:2548-2557 (2022)  
Target
Name:
Flavin reductase (NADPH)
Synonyms:
1.3.1.24 BLVRB BVR-B Biliverdin-IX beta-reductase | FLR
Type:
PROTEIN
Mol. Mass.:
22123.63
Organism:
Homo sapiens
Description:
ChEMBL_100283
Residue:
206
  
Inhibitor
Name:
BDBM50061625
Synonyms:
4-[(5,5,8,8-tetramethyl-5,6,7,8-tetrahydronaphthalen-2-yl)carbamoyl]benzoic acid CHEMBL25202 US11744839, Compound of formula 3 retinobenzoic acid
Type:
Small organic molecule
Emp. Form.:
C22H25NO3
Mol. Mass.:
351.4388
SMILES:
CC1(C)CCC(C)(C)c2cc(NC(=O)c3ccc(cc3)C(O)=O)ccc12
: