Target
Flavin reductase (NADPH)
Ligand
BDBM50058291
Substrate
Meas. Tech.
ChEMBL_2153628 (CHEMBL5038175)
Kd
1349±n/a nM
Citation
 Kim, MHa, JHChoi, JKim, BRGapsys, VLee, KOJee, JGChakrabarti, KSde Groot, BLGriesinger, CRyu, KSLee, D Repositioning Food and Drug Administration-Approved Drugs for Inhibiting Biliverdin IX? Reductase B as a Novel Thrombocytopenia Therapeutic Target. J Med Chem 65:2548-2557 (2022)  
Target
Name:
Flavin reductase (NADPH)
Synonyms:
1.3.1.24 BLVRB BVR-B Biliverdin-IX beta-reductase | FLR
Type:
PROTEIN
Mol. Mass.:
22123.63
Organism:
Homo sapiens
Description:
ChEMBL_100283
Residue:
206
  
Inhibitor
Name:
BDBM50058291
Synonyms:
CHEBI:87193 | CHEMBL1205178
Type:
Small organic molecule
Emp. Form.:
C20H4Br4Cl4O5
Mol. Mass.:
785.671
SMILES:
OC(=O)c1c(Cl)c(Cl)c(Cl)c(Cl)c1-c1c2cc(Br)c(O)c(Br)c2oc2c(Br)c(=O)c(Br)cc12
: