Target
5-hydroxytryptamine receptor 1E
Ligand
BDBM50582603
Substrate
Meas. Tech.
ChEMBL_2155118 (CHEMBL5039778)
Ki
180±n/a nM
Citation
 Lee, JKwag, RLee, SKim, DWoo, JCho, YKim, HJKim, JJeon, BChoo, H Discovery of G Protein-Biased Ligands against 5-HT J Med Chem 64:7453-7467 (2021)  
Target
Name:
5-hydroxytryptamine receptor 1E
Synonyms:
5-HT-1E 5-Hydroxytryptamine Receptor Subtype 1E (5HT1E) 5-hydroxytryptamine receptor 1E (5-HT-1E) (S31) 5HT1E_HUMAN S31 Serotonin 1e (5-HT1e) receptor | Serotonin Receptor 1E
Type:
G Protein-Coupled Receptor (GPCR)
Mol. Mass.:
41697.80
Organism:
Homo sapiens (Human)
Description:
gi_112822
Residue:
365
  
Inhibitor
Name:
BDBM50582603
Synonyms:
CHEMBL5091373
Type:
Small organic molecule
Emp. Form.:
C16H19Cl2NO
Mol. Mass.:
312.234
SMILES:
Cl.CNCCc1ccc(Cl)c(c1)-c1ccccc1OC
: