Target
Cyclic GMP-AMP synthase
Ligand
BDBM50582672
Substrate
Meas. Tech.
ChEMBL_2155362 (CHEMBL5040022)
IC50
7620±n/a nM
Citation
 Tan, JWu, BChen, TFan, CZhao, JXiong, CFeng, CXiao, RDing, CTang, WZhang, A Synthesis and Pharmacological Evaluation of Tetrahydro-?-carboline Derivatives as Potent Anti-inflammatory Agents Targeting Cyclic GMP-AMP Synthase. J Med Chem 64:7667-7690 (2021)  
Target
Name:
Cyclic GMP-AMP synthase
Synonyms:
2'3'-cGAMP synthase CGAS_MOUSE Mab-21 domain-containing protein 1 Synonyms=Mb21d1 m-cGAS
Type:
PROTEIN
Mol. Mass.:
58224.36
Organism:
Mus musculus
Description:
ChEMBL_119133
Residue:
507
  
Inhibitor
Name:
BDBM50582672
Synonyms:
CHEMBL5086305
Type:
Small organic molecule
Emp. Form.:
C27H20Cl2F3N7O3
Mol. Mass.:
618.394
SMILES:
Cn1ccc(n1)-c1cc(Cl)c(Cl)c2[nH]c3CCN(Cc3c12)C(=O)CNC(=O)c1cccc(c1)-c1noc(n1)C(F)(F)F
: