Target
Cyclic GMP-AMP synthase
Ligand
BDBM50582682
Substrate
Meas. Tech.
ChEMBL_2155362 (CHEMBL5040022)
IC50
9560±n/a nM
Citation
 Tan, JWu, BChen, TFan, CZhao, JXiong, CFeng, CXiao, RDing, CTang, WZhang, A Synthesis and Pharmacological Evaluation of Tetrahydro-?-carboline Derivatives as Potent Anti-inflammatory Agents Targeting Cyclic GMP-AMP Synthase. J Med Chem 64:7667-7690 (2021)  
Target
Name:
Cyclic GMP-AMP synthase
Synonyms:
2'3'-cGAMP synthase CGAS_MOUSE Mab-21 domain-containing protein 1 Synonyms=Mb21d1 m-cGAS
Type:
PROTEIN
Mol. Mass.:
58224.36
Organism:
Mus musculus
Description:
ChEMBL_119133
Residue:
507
  
Inhibitor
Name:
BDBM50582682
Synonyms:
CHEMBL5077562
Type:
Small organic molecule
Emp. Form.:
C21H15Cl2F6N3O2
Mol. Mass.:
526.259
SMILES:
OCC(=O)N1CCC2=Nc3c(ccc(Cl)c3Cl)C2(C1)Nc1cc(cc(c1)C(F)(F)F)C(F)(F)F
: