Target
Leucine-rich repeat serine/threonine-protein kinase 2
Ligand
BDBM50582730
Substrate
Meas. Tech.
ChEMBL_2155477 (CHEMBL5040137)
IC50
11±n/a nM
Citation
 Williamson, DSSmith, GPMikkelsen, GKJensen, TAcheson-Dossang, PBadolo, LBedford, STChell, VChen, IJDokurno, PHentzer, MNewland, SRay, SCShaw, TSurgenor, AETerry, LWang, YChristensen, KV Design and Synthesis of Pyrrolo[2,3- J Med Chem 64:10312-10332 (2021)  
Target
Name:
Leucine-rich repeat serine/threonine-protein kinase 2
Synonyms:
2.7.11.1 LRRK2_MOUSE | Lrrk2
Type:
PROTEIN
Mol. Mass.:
284743.80
Organism:
Mus musculus
Description:
ChEMBL_120301
Residue:
2527
  
Inhibitor
Name:
BDBM50582730
Synonyms:
CHEMBL5087055
Type:
Small organic molecule
Emp. Form.:
C21H27N9O
Mol. Mass.:
421.4988
SMILES:
C[C@@H]1CCCN1c1c(C#N)c2c(N)nc(Nc3cnn([C@@H]4CCOC4)c3C)nc2n1C
: