Target
Metabotropic glutamate receptor 2
Ligand
BDBM50151434
Substrate
Meas. Tech.
ChEMBL_303460 (CHEMBL839720)
Ki
1.79±n/a nM
Citation
 Nakazato, ASakagami, KYasuhara, AOhta, HYoshikawa, RItoh, MNakamura, MChaki, S Synthesis, in vitro pharmacology, structure-activity relationships, and pharmacokinetics of 3-alkoxy-2-amino-6-fluorobicyclo[3.1.0]hexane-2,6-dicarboxylic acid derivatives as potent and selective group II metabotropic glutamate receptor antagonists. J Med Chem 47:4570-87 (2004)  
Target
Name:
Metabotropic glutamate receptor 2
Synonyms:
GPRC1B GRM2_HUMAN Metabotropic glutamate receptor mGlu2 | metabotropic glutamate 2
Type:
Enzyme
Mol. Mass.:
95584.88
Organism:
Homo sapiens (Human)
Description:
Q14416
Residue:
872
  
Inhibitor
Name:
BDBM50151434
Synonyms:
(1R,2R,3R,5R,6R)-2-Amino-6-fluoro-3-((S)-1-naphthalen-2-yl-ethoxy)-bicyclo[3.1.0]hexane-2,6-dicarboxylic acid | CHEMBL263312
Type:
Small organic molecule
Emp. Form.:
C20H20FNO5
Mol. Mass.:
373.3749
SMILES:
C[C@H](O[C@@H]1C[C@@H]2[C@@H]([C@@]2(F)C(O)=O)[C@]1(N)C(O)=O)c1ccc2ccccc2c1
: