Target
Sensory histidine kinase DcuS
Ligand
BDBM50151871
Substrate
Meas. Tech.
ChEMBL_305474 (CHEMBL831083)
IC50
0.300±n/a nM
Citation
 Chan, WCCoyle, BJWilliams, P Virulence regulation and quorum sensing in staphylococcal infections: competitive AgrC antagonists as quorum sensing inhibitors. J Med Chem 47:4633-41 (2004)  
Target
Name:
Sensory histidine kinase DcuS
Synonyms:
Receptor-histidine kinase AgrC
Type:
PROTEIN
Mol. Mass.:
49890.25
Organism:
Staphylococcus aureus
Description:
ChEMBL_305973
Residue:
430
  
Inhibitor
Name:
BDBM50151871
Synonyms:
2-{2-[2-Amino-3-(4-hydroxy-phenyl)-propionylamino]-3-hydroxy-propionylamino}-N-(3-benzyl-9,12-bis-hydroxymethyl-6-isobutyl-2,5,8,11,14-pentaoxo-1-thia-4,7,10,13-tetraaza-cyclohexadec-15-yl)-3-hydroxy-butyramide | CHEMBL359961
Type:
Small organic molecule
Emp. Form.:
C40H56N8O13S
Mol. Mass.:
888.983
SMILES:
CC(C)C[C@H]1NC(=O)[C@H](CO)NC(=O)[C@@H](CO)NC(=O)[C@@H](CSC(=O)[C@H](Cc2ccccc2)NC1=O)NC(=O)[C@@H](NC(=O)[C@H](CO)NC(=O)[C@@H](N)Cc1ccc(O)cc1)[C@@H](C)O
: