Target
D(2) dopamine receptor
Ligand
BDBM50152024
Substrate
Meas. Tech.
ChEBML_305866
IC50
0.700000±n/a nM
Citation
 Heinrich, TBöttcher, HGericke, RBartoszyk, GDAnzali, SSeyfried, CAGreiner, HEVan Amsterdam, C Synthesis and structure--activity relationship in a class of indolebutylpiperazines as dual 5-HT(1A) receptor agonists and serotonin reuptake inhibitors. J Med Chem 47:4684-92 (2004)  
Target
Name:
D(2) dopamine receptor
Synonyms:
DOPAMINE D2 DOPAMINE D2 Short Dopamine D2 receptor Drd2
Type:
G Protein-Coupled Receptor (GPCR)
Mol. Mass.:
50931.60
Organism:
Rattus norvegicus (rat)
Description:
P61169
Residue:
444
  
Inhibitor
Name:
BDBM50152024
Synonyms:
3-{4-[4-(2-Methoxy-phenyl)-piperazin-1-yl]-butyl}-1H-indole-5-carbonitrile | CHEMBL427523
Type:
Small organic molecule
Emp. Form.:
C24H28N4O
Mol. Mass.:
388.5053
SMILES:
COc1ccccc1N1CCN(CCCCc2c[nH]c3ccc(cc23)C#N)CC1
: