Target
5'-nucleotidase
Ligand
BDBM50583402
Substrate
Meas. Tech.
ChEMBL_2157216 (CHEMBL5041876)
Ki
2.5±n/a nM
Citation
 Scortichini, MIdris, RMMoschütz, SKeim, ASalmaso, VDobelmann, COliva, PLosenkova, KIrjala, HVaittinen, SSandholm, JYegutkin, GGSträter, NJunker, AMüller, CEJacobson, KA Structure-Activity Relationship of 3-Methylcytidine-5'-?,?-methylenediphosphates as CD73 Inhibitors. J Med Chem 65:2409-2433 (2022)  
Target
Name:
5'-nucleotidase
Synonyms:
5'-NT 5NTD_HUMAN Ecto-5'-nucleotidase NT5 NTE
Type:
Enzyme
Mol. Mass.:
63371.54
Organism:
Homo sapiens (Human)
Description:
P21589
Residue:
574
  
Inhibitor
Name:
BDBM50583402
Synonyms:
CHEMBL5076684
Type:
Small organic molecule
Emp. Form.:
C36H64N6O14P2
Mol. Mass.:
866.8727
SMILES:
CCN(CC)CC.CCN(CC)CC.CCOC(=O)CCNC(=O)c1ccc(CO\N=c2\ccn([C@@H]3O[C@H](COP(O)(=O)CP(O)(O)=O)[C@@H](O)[C@H]3O)c(=O)n2C)cc1
: