Target
Adenosine receptor A3
Ligand
BDBM50106543
Substrate
Meas. Tech.
ChEMBL_2157716 (CHEMBL5042376)
Kd
1.000000±n/a nM
Citation
 Suresh, RRGao, ZGSalmaso, VChen, ECampbell, RGPoe, RBListon, TEJacobson, KA Selective A ACS Med Chem Lett 13:623-631 (2022)  
Target
Name:
Adenosine receptor A3
Synonyms:
AA3R_RAT Adenosine receptor A2a and A3 | Adora3
Type:
PROTEIN
Mol. Mass.:
36643.73
Organism:
Rattus norvegicus
Description:
ChEMBL_479910
Residue:
320
  
Inhibitor
Name:
BDBM50106543
Synonyms:
5-[6-(4-Amino-3-iodo-benzylamino)-purin-9-yl]-3,4-dihydroxy-tetrahydro-furan-2-carboxylic acid methylamide IAB-MECA
Type:
Small organic molecule
Emp. Form.:
C18H20IN7O4
Mol. Mass.:
525.3004
SMILES:
CNC(=O)[C@H]1O[C@H]([C@H](O)[C@@H]1O)n1cnc2c(NCc3ccc(N)c(I)c3)ncnc12
: