Target
Neuropeptide FF receptor 1
Ligand
BDBM50583780
Substrate
Meas. Tech.
ChEMBL_2158113 (CHEMBL5042863)
Ki
591±n/a nM
Citation
 Quillet, RSchneider, SUtard, VDrieu la Rochelle, AElhabazi, KHenningsen, JBGizzi, PSchmitt, MKugler, VSimonneaux, VIlien, BSimonin, FBihel, F Identification of an  J Med Chem 64:7555-7564 (2021)  
Target
Name:
Neuropeptide FF receptor 1
Synonyms:
G-protein coupled receptor 147 NPFF1 NPFFR1 | RFamide-related peptide receptor OT7T022
Type:
PROTEIN
Mol. Mass.:
47840.07
Organism:
Homo sapiens (Human)
Description:
ChEMBL_1474637
Residue:
430
  
Inhibitor
Name:
BDBM50583780
Synonyms:
CHEMBL5085023
Type:
Small organic molecule
Emp. Form.:
C30H40N6O3
Mol. Mass.:
532.677
SMILES:
[#7]-[#6](=[#7])-[#7]-[#6]-[#6]-[#6]-[#6@@H](-[#7]-[#6](=O)\[#6]=[#6](\c1ccccc1)-c1ccccc1)-[#6](=O)-[#7]-[#6@@H](-[#6]-[#6]-1-[#6]-[#6]-[#6]-[#6]-[#6]-1)-[#6](-[#7])=O
: