Target
Neuropeptide FF receptor 1
Ligand
BDBM50565180
Substrate
Meas. Tech.
ChEMBL_2158113 (CHEMBL5042863)
Ki
58±n/a nM
Citation
 Quillet, RSchneider, SUtard, VDrieu la Rochelle, AElhabazi, KHenningsen, JBGizzi, PSchmitt, MKugler, VSimonneaux, VIlien, BSimonin, FBihel, F Identification of an  J Med Chem 64:7555-7564 (2021)  
Target
Name:
Neuropeptide FF receptor 1
Synonyms:
G-protein coupled receptor 147 NPFF1 NPFFR1 | RFamide-related peptide receptor OT7T022
Type:
PROTEIN
Mol. Mass.:
47840.07
Organism:
Homo sapiens (Human)
Description:
ChEMBL_1474637
Residue:
430
  
Inhibitor
Name:
BDBM50565180
Synonyms:
CHEMBL4776204
Type:
Small organic molecule
Emp. Form.:
C28H32N6O3
Mol. Mass.:
500.5921
SMILES:
NC(=N)NCCC[C@@H](NC(=O)C(c1ccccc1)c1ccccc1)C(=O)N[C@@H](C(N)=O)c1ccccc1
: