Target
Neuropeptide FF receptor 2
Ligand
BDBM50583771
Substrate
Meas. Tech.
ChEMBL_2158114 (CHEMBL5042864)
Ki
153±n/a nM
Citation
 Quillet, RSchneider, SUtard, VDrieu la Rochelle, AElhabazi, KHenningsen, JBGizzi, PSchmitt, MKugler, VSimonneaux, VIlien, BSimonin, FBihel, F Identification of an  J Med Chem 64:7555-7564 (2021)  
Target
Name:
Neuropeptide FF receptor 2
Synonyms:
G-protein coupled receptor 74 GPR74 NPFF2_HUMAN NPGPR Neuropeptide G-protein coupled receptor
Type:
Enzyme Catalytic Domain
Mol. Mass.:
60293.78
Organism:
Homo sapiens (Human)
Description:
NPFF2 0 HUMAN::Q9Y5X5
Residue:
522
  
Inhibitor
Name:
BDBM50583771
Synonyms:
CHEMBL5084208
Type:
Small organic molecule
Emp. Form.:
C32H35N7O3
Mol. Mass.:
565.6654
SMILES:
NC(=N)NCCC[C@@H](NC(=O)C=C(c1ccccc1)c1ccccc1)C(=O)N[C@@H](Cc1c[nH]c2ccccc12)C(N)=O
: