Target
Melanin-concentrating hormone receptor 1
Ligand
BDBM50153209
Substrate
Meas. Tech.
ChEMBL_306822 (CHEMBL831013)
IC50
50±n/a nM
Citation
 Receveur, JMBjurling, EUlven, TLittle, PBNørregaard, PKHögberg, T 4-Acylamino-and 4-ureidobenzamides as melanin-concentrating hormone (MCH) receptor 1 antagonists. Bioorg Med Chem Lett 14:5075-80 (2004)  
Target
Name:
Melanin-concentrating hormone receptor 1
Synonyms:
G-protein coupled receptor 24 MCH receptor 1 MCH-R1 MCHR-1 MCHR1_HUMAN Melanin-Concentrating Hormone Receptor 1 (MCH1R) Melanin-concentrating hormone receptor 1 (MCH-1) Melanin-concentrating hormone receptor 1 (MCHR-1) SLC-1 Somatostatin receptor-like protein
Type:
G Protein-Coupled Receptor (GPCR)
Mol. Mass.:
45976.27
Organism:
Homo sapiens (Human)
Description:
Membranes from CHO-K1 cells stably expressing human MCH1R were used in assays.
Residue:
422
  
Inhibitor
Name:
BDBM50153209
Synonyms:
CHEMBL365055 | N-(2-Diethylamino-ethyl)-2-methoxy-4-[3-(4-trifluoromethoxy-phenyl)-ureido]-benzamide
Type:
Small organic molecule
Emp. Form.:
C22H27F3N4O4
Mol. Mass.:
468.4694
SMILES:
CCN(CC)CCNC(=O)c1ccc(NC(=O)Nc2ccc(OC(F)(F)F)cc2)cc1OC
: