Target
Melanin-concentrating hormone receptor 2
Ligand
BDBM50153206
Substrate
Meas. Tech.
ChEMBL_306823 (CHEMBL831014)
IC50
10000±n/a nM
Citation
 Receveur, JMBjurling, EUlven, TLittle, PBNørregaard, PKHögberg, T 4-Acylamino-and 4-ureidobenzamides as melanin-concentrating hormone (MCH) receptor 1 antagonists. Bioorg Med Chem Lett 14:5075-80 (2004)  
Target
Name:
Melanin-concentrating hormone receptor 2
Synonyms:
GPR145 MCHR2_HUMAN Melanin-concentrating hormone receptor SLT
Type:
Enzyme Catalytic Domain
Mol. Mass.:
38862.16
Organism:
Homo sapiens (Human)
Description:
Melanin Concentrating Hormone 2 GPR145 HUMAN::Q969V1
Residue:
340
  
Inhibitor
Name:
BDBM50153206
Synonyms:
2-Methoxy-4-[3-(4-phenoxy-phenyl)-ureido]-N-(3-piperidin-1-yl-propyl)-benzamide | CHEMBL182554
Type:
Small organic molecule
Emp. Form.:
C29H34N4O4
Mol. Mass.:
502.6047
SMILES:
COc1cc(NC(=O)Nc2ccc(Oc3ccccc3)cc2)ccc1C(=O)NCCCN1CCCCC1
: