Target
Nuclear receptor subfamily 2 group E member 1
Ligand
BDBM50584383
Substrate
Meas. Tech.
ChEMBL_2159731 (CHEMBL5044481)
EC50
19953±n/a nM
Citation
 Faudone, GZhubi, RCelik, FKnapp, SChaikuad, AHeering, JMerk, D Design of a Potent TLX Agonist by Rational Fragment Fusion. J Med Chem 65:2288-2296 (2022)  
Target
Name:
Nuclear receptor subfamily 2 group E member 1
Synonyms:
NR2E1 Nuclear receptor TLX TLX hTll
Type:
PROTEIN
Mol. Mass.:
42606.25
Organism:
Homo sapiens
Description:
ChEMBL_104473
Residue:
385
  
Inhibitor
Name:
BDBM50584383
Synonyms:
CHEMBL5080162 | EN300-5601139
Type:
Small organic molecule
Emp. Form.:
C11H10F3N3
Mol. Mass.:
241.2124
SMILES:
Cc1cn(cn1)-c1cc(N)cc(c1)C(F)(F)F
: