Target
ATPase family AAA domain-containing protein 2
Ligand
BDBM50584938
Substrate
Meas. Tech.
ChEMBL_2160908 (CHEMBL5045658)
IC50
501±n/a nM
Citation
 Winter-Holt, JJBardelle, CChiarparin, EDale, ILDavey, PRJDavies, NLDenz, CFillery, SMGuérot, CMHan, FHughes, SJKulkarni, MLiu, ZMilbradt, AMoss, TANiu, HPatel, JRabow, AASchimpl, MShi, JSun, DYang, DGuichard, S Discovery of a Potent and Selective ATAD2 Bromodomain Inhibitor with Antiproliferative Activity in Breast Cancer Models. J Med Chem 65:3306-3331 (2022)  
Target
Name:
ATPase family AAA domain-containing protein 2
Synonyms:
AAA nuclear coregulator cancer-associated protein ATAD2 PRO2000
Type:
PROTEIN
Mol. Mass.:
158546.30
Organism:
Homo sapiens (Human)
Description:
ChEMBL_1500426
Residue:
1390
  
Inhibitor
Name:
BDBM50584938
Synonyms:
CHEMBL5086260
Type:
Small organic molecule
Emp. Form.:
C26H21F3N4O4
Mol. Mass.:
510.4645
SMILES:
[H][C@]12Cc3ccccc3[C@]([H])([C@@H](C)NC1=O)N2C(=O)c1cn(C)c(=O)c2[nH]c3ccc(OC(F)(F)F)cc3c12
: