Target
Pantetheinase
Ligand
BDBM480973
Substrate
Meas. Tech.
ChEMBL_2162817 (CHEMBL5047678)
IC50
10±n/a nM
Citation
 Casimiro-Garcia, AAllais, CBrennan, AChoi, CDower, GFarley, KAFleming, MFlick, AFrisbie, RKHall, JHepworth, DJones, HKnafels, JDKortum, SLovering, FEMathias, JPMohan, SMorgan, PMParng, CParris, KPullen, NSchlerman, FStansfield, JStrohbach, JWVajdos, FFVincent, FWang, HWang, XWebster, RWright, SW Discovery of a Series of Pyrimidine Carboxamides as Inhibitors of Vanin-1. J Med Chem 65:757-784 (2022)  
Target
Name:
Pantetheinase
Synonyms:
3.5.1.92 VNN1_MOUSE Vascular non-inflammatory molecule 1 | Vnn1
Type:
PROTEIN
Mol. Mass.:
57084.66
Organism:
Mus musculus
Description:
ChEMBL_120311
Residue:
512
  
Inhibitor
Name:
BDBM480973
Synonyms:
US10906888, Example 190
Type:
Small organic molecule
Emp. Form.:
C17H20N6O
Mol. Mass.:
324.3803
SMILES:
O=C(N1CCCCC1)c1cnc(NC2(CC2)c2cncnc2)nc1
: