Target
Biotinidase
Ligand
BDBM480783
Substrate
Meas. Tech.
ChEMBL_2162821 (CHEMBL5047682)
IC50
11300±n/a nM
Citation
 Casimiro-Garcia, AAllais, CBrennan, AChoi, CDower, GFarley, KAFleming, MFlick, AFrisbie, RKHall, JHepworth, DJones, HKnafels, JDKortum, SLovering, FEMathias, JPMohan, SMorgan, PMParng, CParris, KPullen, NSchlerman, FStansfield, JStrohbach, JWVajdos, FFVincent, FWang, HWang, XWebster, RWright, SW Discovery of a Series of Pyrimidine Carboxamides as Inhibitors of Vanin-1. J Med Chem 65:757-784 (2022)  
Target
Name:
Biotinidase
Synonyms:
3.5.1.12 BTD_HUMAN | Biotinase
Type:
PROTEIN
Mol. Mass.:
61128.20
Organism:
Homo sapiens
Description:
ChEMBL_120314
Residue:
543
  
Inhibitor
Name:
BDBM480783
Synonyms:
US10906888, Example 1
Type:
Small organic molecule
Emp. Form.:
C19H23N5O2
Mol. Mass.:
353.4182
SMILES:
O=C(N1CCC2(C1)CCOCC2)c1cnc(NCc2cccnc2)nc1
: