Target
Biotinidase
Ligand
BDBM480931
Substrate
Meas. Tech.
ChEMBL_2162821 (CHEMBL5047682)
IC50
2800±n/a nM
Citation
 Casimiro-Garcia, AAllais, CBrennan, AChoi, CDower, GFarley, KAFleming, MFlick, AFrisbie, RKHall, JHepworth, DJones, HKnafels, JDKortum, SLovering, FEMathias, JPMohan, SMorgan, PMParng, CParris, KPullen, NSchlerman, FStansfield, JStrohbach, JWVajdos, FFVincent, FWang, HWang, XWebster, RWright, SW Discovery of a Series of Pyrimidine Carboxamides as Inhibitors of Vanin-1. J Med Chem 65:757-784 (2022)  
Target
Name:
Biotinidase
Synonyms:
3.5.1.12 BTD_HUMAN | Biotinase
Type:
PROTEIN
Mol. Mass.:
61128.20
Organism:
Homo sapiens
Description:
ChEMBL_120314
Residue:
543
  
Inhibitor
Name:
BDBM480931
Synonyms:
8-oxa-2-azaspiro[4.5]dec-2-yl(2-{[(1S)-1-(pyrazin-2-yl)ethyl]amino}pyrimidin-5-yl)methanone | US10906888, Example 145
Type:
Small organic molecule
Emp. Form.:
C19H24N6O2
Mol. Mass.:
368.4329
SMILES:
C[C@H](Nc1ncc(cn1)C(=O)N1CCC2(C1)CCOCC2)c1cnccn1
: