Target
Biotinidase
Ligand
BDBM480933
Substrate
Meas. Tech.
ChEMBL_2162821 (CHEMBL5047682)
IC50
40±n/a nM
Citation
 Casimiro-Garcia, AAllais, CBrennan, AChoi, CDower, GFarley, KAFleming, MFlick, AFrisbie, RKHall, JHepworth, DJones, HKnafels, JDKortum, SLovering, FEMathias, JPMohan, SMorgan, PMParng, CParris, KPullen, NSchlerman, FStansfield, JStrohbach, JWVajdos, FFVincent, FWang, HWang, XWebster, RWright, SW Discovery of a Series of Pyrimidine Carboxamides as Inhibitors of Vanin-1. J Med Chem 65:757-784 (2022)  
Target
Name:
Biotinidase
Synonyms:
3.5.1.12 BTD_HUMAN | Biotinase
Type:
PROTEIN
Mol. Mass.:
61128.20
Organism:
Homo sapiens
Description:
ChEMBL_120314
Residue:
543
  
Inhibitor
Name:
BDBM480933
Synonyms:
US10906888, Example 147
Type:
Small organic molecule
Emp. Form.:
C18H22N6O2
Mol. Mass.:
354.4063
SMILES:
C[C@H](Nc1ncc(cn1)C(=O)N1CC2(C1)CCOCC2)c1cnccn1
: