Target
Histone deacetylase 6
Ligand
BDBM50585748
Substrate
Meas. Tech.
ChEMBL_2163767 (CHEMBL5048628)
IC50
12000±n/a nM
Citation
 Belayet, JBBeamish, SRahaman, MAlanani, SVirdi, RSFrick, DNRahman, AFMTUlicki, JSBiswas, SArnold, LARoni, MSRCheng, EYSteeber, DAFrick, KMHossain, MM Development of a Novel, Small-Molecule Brain-Penetrant Histone Deacetylase Inhibitor That Enhances Spatial Memory Formation in Mice. J Med Chem 65:3388-3403 (2022)  
Target
Name:
Histone deacetylase 6
Synonyms:
Cereblon/Histone deacetylase 6 HDAC6 Histone deacetylase 6 (HDAC6) KIAA0901 | ORF Names:JM21
Type:
Chromatin regulator; hydrolase; repressor
Mol. Mass.:
131381.51
Organism:
Homo sapiens (Human)
Description:
Q9UBN7
Residue:
1215
  
Inhibitor
Name:
BDBM50585748
Synonyms:
CHEMBL5086240
Type:
Small organic molecule
Emp. Form.:
C22H38O6S2
Mol. Mass.:
462.664
SMILES:
CC(C)(C)OC(=O)CC(O)\C=C\CCSSCC\C=C\C(O)CC(=O)OC(C)(C)C
: