Target
Cyclin-dependent kinase 2/G1/S-specific cyclin-E1
Ligand
BDBM50155220
Substrate
Meas. Tech.
ChEMBL_306344 (CHEMBL828163)
IC50
100±n/a nM
Citation
 Helal, CJSanner, MACooper, CBGant, TAdam, MLucas, JCKang, ZKupchinsky, SAhlijanian, MKTate, BMenniti, FSKelly, KPeterson, M Discovery and SAR of 2-aminothiazole inhibitors of cyclin-dependent kinase 5/p25 as a potential treatment for Alzheimer's disease. Bioorg Med Chem Lett 14:5521-5 (2004)  
Target
Name:
Cyclin-dependent kinase 2/G1/S-specific cyclin-E1
Synonyms:
CDK2/CycE CDK2/E Cyclin-Dependent Kinase 2 (CDK2) Cyclin-dependent kinase 2/cyclin E1
Type:
Protein
Mol. Mass.:
Description:
Components:
This complex has 2 components.
Component 1
Name:
Cyclin-dependent kinase 2
Synonyms:
CDK2 CDK2_HUMAN Cell division protein kinase 2 Protein cereblon/Cyclin-dependent kinase 2 | p33 protein kinase
Type:
Enzyme Subunit
Mol. Mass.:
33938.17
Organism:
Homo sapiens (Human)
Description:
P24941
Residue:
298
  
Component 2
Name:
G1/S-specific cyclin-E1
Synonyms:
CCNE CCNE1_HUMAN
Type:
Enzyme Subunit
Mol. Mass.:
47073.17
Organism:
Homo sapiens (Human)
Description:
Residue:
410
  
Inhibitor
Name:
BDBM50155220
Synonyms:
CHEMBL364338 | N-(5-Cyclobutyl-thiazol-2-yl)-2-indol-1-yl-acetamide
Type:
Small organic molecule
Emp. Form.:
C17H17N3OS
Mol. Mass.:
311.401
SMILES:
O=C(Cn1ccc2ccccc12)Nc1ncc(s1)C1CCC1
: