Target
5-hydroxytryptamine receptor 1A
Ligand
BDBM82517
Substrate
Meas. Tech.
ChEMBL_303482 (CHEMBL838856)
Ki
0.6±n/a nM
Citation
 Bojarski, AJDuszynska, BKolaczkowski, MKowalski, PKowalska, T The impact of spacer structure on 5-HT7 and 5-HT1A receptor affinity in the group of long-chain arylpiperazine ligands. Bioorg Med Chem Lett 14:5863-6 (2004)  
Target
Name:
5-hydroxytryptamine receptor 1A
Synonyms:
5-HT-1A 5-HT1A 5-hydroxytryptamine receptor 1A (5HT1A) 5ht1a Htr1a Serotonin 1a (5-HT1a) receptor/Adrenergic receptor alpha-1 | Serotonin receptor 1A
Type:
G Protein-Coupled Receptor (GPCR)
Mol. Mass.:
46445.29
Organism:
Rattus norvegicus (rat)
Description:
Binding assays were performed using rat hippocampal membranes.
Residue:
422
  
Inhibitor
Name:
BDBM82517
Synonyms:
2-{4-[4-(2-Methoxy-phenyl)-piperazin-1-yl]-butyl}-isoindole-1,3-dione CHEMBL126632 NAN-190 | NSC_107966
Type:
Small organic molecule
Emp. Form.:
C23H27N3O3
Mol. Mass.:
393.4788
SMILES:
COc1ccccc1N1CCN(CCCCN2C(=O)c3ccccc3C2=O)CC1
: