Target
Phosphatidylinositol 3,4,5-trisphosphate 5-phosphatase 2
Ligand
BDBM50333645
Substrate
Meas. Tech.
ChEMBL_2168502 (CHEMBL5053561)
IC50
35500±n/a nM
Citation
 Whitfield, HHemmings, AMMills, SJBaker, KWhite, GRushworth, SRiley, AMPotter, BVLBrearley, CA Allosteric Site on SHIP2 Identified Through Fluorescent Ligand Screening and Crystallography: A Potential New Target for Intervention. J Med Chem 64:3813-3826 (2021)  
Target
Name:
Phosphatidylinositol 3,4,5-trisphosphate 5-phosphatase 2
Synonyms:
INPPL-1 Inositol polyphosphate phosphatase-like protein 1 Protein 51C SHIP-2 SHIP2_HUMAN | Src homology-2 domain containing protein tyrosine phosphatase-2 (SHP2)
Type:
Enzyme
Mol. Mass.:
138596.65
Organism:
Homo sapiens (Human)
Description:
O15357
Residue:
1258
  
Inhibitor
Name:
BDBM50333645
Synonyms:
CHEMBL1756 | Estramustine phosphate
Type:
Small organic molecule
Emp. Form.:
C23H32Cl2NO6P
Mol. Mass.:
520.383
SMILES:
C[C@]12CC[C@H]3[C@@H](CCc4cc(OC(=O)N(CCCl)CCCl)ccc34)[C@@H]1CC[C@@H]2OP(O)(O)=O
: