Target
Histamine H3 receptor
Ligand
BDBM50159110
Substrate
Meas. Tech.
ChEMBL_2168798 (CHEMBL5053857)
Ki
0.060256±n/a nM
Citation
 Rosier, NGrätz, LSchihada, HMöller, JI?bilir, AHumphrys, LJNagl, MSeibel, ULohse, MJPockes, S A Versatile Sub-Nanomolar Fluorescent Ligand Enables NanoBRET Binding Studies and Single-Molecule Microscopy at the Histamine H J Med Chem 64:11695-11708 (2021)  
Target
Name:
Histamine H3 receptor
Synonyms:
G-protein coupled receptor 97 HH3R HRH3 Histamine H3 receptor (H3) Histamine receptor (H3 and H4)
Type:
G Protein-Coupled Receptor (GPCR)
Mol. Mass.:
48691.47
Organism:
Homo sapiens (Human)
Description:
Binding assays were using CHO cells stably expressing hH3R receptors.
Residue:
445
  
Inhibitor
Name:
BDBM50159110
Synonyms:
1-(3-(4-(piperidin-1-ylmethyl)phenoxy)propyl)piperidine 1-[3-(4-hexahydro-1-pyridinylmethylphenoxy)propyl]hexahydropyridine CHEMBL129542 | JNJ-5207852
Type:
Small organic molecule
Emp. Form.:
C20H32N2O
Mol. Mass.:
316.4809
SMILES:
C(COc1ccc(CN2CCCCC2)cc1)CN1CCCCC1
: