Target
Beclin-1
Ligand
BDBM50586565
Substrate
Meas. Tech.
ChEMBL_2169048 (CHEMBL5054107)
Kd
860±n/a nM
Citation
 Yang, QQiu, XZhang, XYu, YLi, NWei, XFeng, GLi, YZhao, YWang, R Optimization of Beclin 1-Targeting Stapled Peptides by Staple Scanning Leads to Enhanced Antiproliferative Potency in Cancer Cells. J Med Chem 64:13475-13486 (2021)  
Target
Name:
Beclin-1
Synonyms:
BECN1 Beclin-1-C 35 kDa Coiled-coil myosin-like BCL2-interacting protein Protein GT197
Type:
PROTEIN
Mol. Mass.:
51874.54
Organism:
Homo sapiens
Description:
ChEMBL_118255
Residue:
450
  
Inhibitor
Name:
BDBM50586565
Synonyms:
CHEMBL5077489
Type:
Small organic molecule
Emp. Form.:
C150H268N62O36
Mol. Mass.:
3516.1267
SMILES:
CC[C@H](C)[C@H](NC(=O)[C@H](CC(C)C)NC(=O)[C@H](CCCNC(N)=N)NC(=O)[C@H](CCCNC(N)=N)NC(=O)[C@H](CCCNC(N)=N)NC(=O)[C@H](CCCNC(N)=N)NC(=O)[C@H](CCC(N)=O)NC(=O)[C@H](CCCNC(N)=N)NC(=O)[C@H](CCCNC(N)=N)NC(=O)[C@H](CCCCN)NC(=O)[C@H](CCCCN)NC(=O)[C@H](CCCNC(N)=N)NC(=O)CNC(=O)[C@H](Cc1ccc(O)cc1)NC(C)=O)C(=O)N[C@@H](CCC(N)=O)C(=O)N[C@@H]1CCCCCC\C=C\CCC[C@H](NC(=O)[C@H](CCCCN)NC(=O)[C@H](CCC(O)=O)NC(=O)[C@H](CCCNC(N)=N)NC(=O)[C@H](CC(O)=O)NC(=O)[C@H](CCC(O)=O)NC(=O)[C@H](CCCNC(N)=N)NC1=O)C(=O)N[C@@H](CCCNC(N)=N)C(=O)N[C@@H](C)C(=O)N[C@@H](C(C)C)C(N)=O
: