Target
Metabotropic glutamate receptor 5
Ligand
BDBM50156071
Substrate
Meas. Tech.
ChEMBL_304169 (CHEMBL830007)
EC50
20±n/a nM
Citation
 Lindsley, CWWisnoski, DDLeister, WHO'brien, JALemaire, WWilliams, DLBurno, MSur, CKinney, GGPettibone, DJTiller, PRSmith, SDuggan, MEHartman, GDConn, PJHuff, JR Discovery of positive allosteric modulators for the metabotropic glutamate receptor subtype 5 from a series of N-(1,3-diphenyl-1H- pyrazol-5-yl)benzamides that potentiate receptor function in vivo. J Med Chem 47:5825-8 (2004)  
Target
Name:
Metabotropic glutamate receptor 5
Synonyms:
GRM5_RAT Grm5 Mglur5 metabotropic glutamate 5/1-C metabotropic glutamate 5a
Type:
Enzyme
Mol. Mass.:
131900.14
Organism:
Rattus norvegicus (Rat)
Description:
P31424
Residue:
1203
  
Inhibitor
Name:
BDBM50156071
Synonyms:
3-Cyano-N-(2,5-diphenyl-2H-pyrazol-3-yl)-benzamide CHEMBL190270
Type:
Small organic molecule
Emp. Form.:
C23H16N4O
Mol. Mass.:
364.3993
SMILES:
O=C(Nc1cc(nn1-c1ccccc1)-c1ccccc1)c1cccc(c1)C#N
: