Target
Beta-2 adrenergic receptor
Ligand
BDBM50156260
Substrate
Meas. Tech.
ChEMBL_303402 (CHEMBL839159)
Ki
48±n/a nM
Citation
 Sawa, MTateishi, HMizuno, KHarada, HOue, MTsujiuchi, HFurutani, YKato, S Tryptamine-based human beta3-adrenergic receptor agonists. Part 2: SAR of the methylene derivatives. Bioorg Med Chem Lett 14:5963-6 (2004)  
Target
Name:
Beta-2 adrenergic receptor
Synonyms:
ADRB2 ADRB2_HUMAN Beta-2 adrenoceptor | Beta-2 adrenoreceptor
Type:
Mol. Mass.:
46461.69
Organism:
Homo sapiens (Human)
Description:
P07550
Residue:
413
  
Inhibitor
Name:
BDBM50156260
Synonyms:
CHEMBL184407 | Methanesulfonic acid 3-(2-{(R)-(R)-2-hydroxy-2-[3-(thiophene-2-sulfonylamino)-phenyl]-ethylamino}-propyl)-1H-indol-7-yl ester
Type:
Small organic molecule
Emp. Form.:
C24H27N3O6S3
Mol. Mass.:
549.683
SMILES:
C[C@H](Cc1c[nH]c2c(OS(C)(=O)=O)cccc12)NC[C@H](O)c1cccc(NS(=O)(=O)c2cccs2)c1
: