Target
Potassium voltage-gated channel subfamily H member 2
Ligand
BDBM50156458
Substrate
Meas. Tech.
ChEMBL_304964 (CHEMBL827842)
IC50
76800±n/a nM
Citation
 Vaz, RJGao, ZPribish, JChen, XLevell, JDavis, LAlbert, EBrollo, MUgolini, ACramer, DMCairns, JSides, KLiu, FKwong, JKang, JRebello, SElliot, MLim, HChellaraj, VSingleton, RWLi, Y Design of bivalent ligands using hydrogen bond linkers: synthesis and evaluation of inhibitors for human beta-tryptase. Bioorg Med Chem Lett 14:6053-6 (2004)  
Target
Name:
Potassium voltage-gated channel subfamily H member 2
Synonyms:
1,3-beta-glucan synthase component GLS2 ERG Eag-related protein 1 Ether-a-go-go-related gene (HERG) Ether-a-go-go-related gene potassium channel 1 Ether-a-go-go-related gene potassium channel 1 (hERG1) Ether-a-go-go-related protein 1 H-ERG KCNH2 Potassium voltage-gated channel subfamily H member 2 (hERG) Voltage-gated potassium channel subunit Kv11.1 hERG Potassium Channel 1 | putative potassium channel subunit
Type:
Multi-pass membrane protein
Mol. Mass.:
126672.65
Organism:
Homo sapiens (Human)
Description:
Q12809
Residue:
1159
  
Inhibitor
Name:
BDBM50156458
Synonyms:
3-[4-(5-Aminomethyl-2-fluoro-phenyl)-piperidine-1-carbonyl]-5-(3-thiophen-2-yl-[1,2,4]oxadiazol-5-yl)-benzoic acid | CHEMBL188068
Type:
Small organic molecule
Emp. Form.:
C26H23FN4O4S
Mol. Mass.:
506.549
SMILES:
NCc1ccc(F)c(c1)C1CCN(CC1)C(=O)c1cc(cc(c1)-c1nc(no1)-c1cccs1)C(O)=O
: