Target
Cytochrome P450 2D6
Ligand
BDBM50587150
Substrate
Meas. Tech.
ChEMBL_2171278 (CHEMBL5056412)
IC50
33200±n/a nM
Citation
 Pribut, ND'Erasmo, MDasari, MGiesler, KEIskandar, SSharma, SKBartsch, PWRaghuram, ABushnev, AHwang, SSBurton, SLDerdeyn, CABasson, AELiotta, DCMiller, EJ ?-Functionalized Lipid Prodrugs of HIV NtRTI Tenofovir with Enhanced Pharmacokinetic Properties. J Med Chem 64:12917-12937 (2021)  
Target
Name:
Cytochrome P450 2D6
Synonyms:
CP2D6_HUMAN CYP2DL1 Cytochrome P450 2D6 (CYP2D6) P450-DB1
Type:
Protein
Mol. Mass.:
55774.82
Organism:
Homo sapiens (Human)
Description:
P10635
Residue:
497
  
Inhibitor
Name:
BDBM50587150
Synonyms:
CHEMBL5086954
Type:
Small organic molecule
Emp. Form.:
C29H57N6O4P
Mol. Mass.:
584.7744
SMILES:
N.CCCCCCCCCCCCCCCCCCCCOP(O)(=O)CO[C@H](C)Cn1cnc2c(N)ncnc12
: