Target
Cytochrome P450 2D6
Ligand
BDBM50587162
Substrate
Meas. Tech.
ChEMBL_2171278 (CHEMBL5056412)
IC50
>20000±n/a nM
Citation
 Pribut, ND'Erasmo, MDasari, MGiesler, KEIskandar, SSharma, SKBartsch, PWRaghuram, ABushnev, AHwang, SSBurton, SLDerdeyn, CABasson, AELiotta, DCMiller, EJ ?-Functionalized Lipid Prodrugs of HIV NtRTI Tenofovir with Enhanced Pharmacokinetic Properties. J Med Chem 64:12917-12937 (2021)  
Target
Name:
Cytochrome P450 2D6
Synonyms:
CP2D6_HUMAN CYP2DL1 Cytochrome P450 2D6 (CYP2D6) P450-DB1
Type:
Protein
Mol. Mass.:
55774.82
Organism:
Homo sapiens (Human)
Description:
P10635
Residue:
497
  
Inhibitor
Name:
BDBM50587162
Synonyms:
CHEMBL5092626
Type:
Small organic molecule
Emp. Form.:
C28H52F3N6O5P
Mol. Mass.:
640.7187
SMILES:
N.C[C@H](Cn1cnc2c(N)ncnc12)OCP(O)(=O)OCCCOCCCCCCCCCCCCCCCC(F)(F)F
: