Target
Cytochrome P450 3A4
Ligand
BDBM50587154
Substrate
Meas. Tech.
ChEMBL_2171279 (CHEMBL5056413)
IC50
>50000±n/a nM
Citation
 Pribut, ND'Erasmo, MDasari, MGiesler, KEIskandar, SSharma, SKBartsch, PWRaghuram, ABushnev, AHwang, SSBurton, SLDerdeyn, CABasson, AELiotta, DCMiller, EJ ?-Functionalized Lipid Prodrugs of HIV NtRTI Tenofovir with Enhanced Pharmacokinetic Properties. J Med Chem 64:12917-12937 (2021)  
Target
Name:
Cytochrome P450 3A4
Synonyms:
Albendazole monooxygenase CP3A4_HUMAN CYP3A4 CYPIIIA4 Cytochrome P450 3A4 (CYP3A4) Nifedipine oxidase Taurochenodeoxycholate 6-alpha-hydroxylase
Type:
Enzyme
Mol. Mass.:
57349.57
Organism:
Homo sapiens (Human)
Description:
Residue:
503
  
Inhibitor
Name:
BDBM50587154
Synonyms:
CHEMBL5084207
Type:
Small organic molecule
Emp. Form.:
C29H53N6O4P
Mol. Mass.:
580.7427
SMILES:
N.C[C@H](Cn1cnc2c(N)ncnc12)OCP(O)(=O)OCCCCCCCCCCCCCCCCCCC#C
: