Target
Substance-K receptor
Ligand
BDBM50159870
Substrate
Meas. Tech.
ChEMBL_303375 (CHEMBL839693)
Ki
>3000±n/a nM
Citation
 D'Andrea, PPorcelloni, MMadami, APatacchini, RAltamura, MFattori, D Generation of a new class of hNK(2) receptor ligands using the 'fragment approach'. Bioorg Med Chem Lett 15:585-8 (2005)  
Target
Name:
Substance-K receptor
Synonyms:
NK-2 receptor NK2R NKNAR Neurokinin A receptor Neurokinin-2 (NK-2) SKR TACR2 Tachykinin receptor 2 (NK2) | hnk-3
Type:
Protein
Mol. Mass.:
44455.78
Organism:
Homo sapiens (Human)
Description:
P21452
Residue:
398
  
Inhibitor
Name:
BDBM50159870
Synonyms:
(R)-2-[3-Methyl-3-(4-phenoxy-phenyl)-ureido]-N-(3-morpholin-4-yl-propyl)-3-phenyl-propionamide | CHEMBL180238
Type:
Small organic molecule
Emp. Form.:
C30H36N4O4
Mol. Mass.:
516.6312
SMILES:
CN(C(=O)N[C@H](Cc1ccccc1)C(=O)NCCCN1CCOCC1)c1ccc(Oc2ccccc2)cc1
: