Target
Prostaglandin E2 receptor EP1 subtype
Ligand
BDBM50160909
Substrate
Meas. Tech.
ChEMBL_302785 (CHEMBL839470)
Ki
4±n/a nM
Citation
 Ducharme, YBlouin, MCarrière, MCChateauneuf, ACôté, BDenis, DFrenette, RGreig, GKargman, SLamontagne, SMartins, ENantel, FO'Neill, GSawyer, NMetters, KMFriesen, RW 2,3-Diarylthiophenes as selective EP1 receptor antagonists. Bioorg Med Chem Lett 15:1155-60 (2005)  
Target
Name:
Prostaglandin E2 receptor EP1 subtype
Synonyms:
PE2R1_HUMAN PTGER1 Prostaglandin E2 receptor EP1 subtype Prostanoid EP1 receptor
Type:
Enzyme
Mol. Mass.:
41834.57
Organism:
Homo sapiens (Human)
Description:
P34995
Residue:
402
  
Inhibitor
Name:
BDBM50160909
Synonyms:
1-{5-[3-(2-Benzyloxy-5-chloro-phenyl)-thiophen-2-yl]-pyridin-3-yl}-2,2,2-trifluoro-ethane-1,1-diol | CHEMBL185346
Type:
Small organic molecule
Emp. Form.:
C24H17ClF3NO3S
Mol. Mass.:
491.91
SMILES:
OC(O)(c1cncc(c1)-c1sccc1-c1cc(Cl)ccc1OCc1ccccc1)C(F)(F)F
: