Target
Prostaglandin E2 receptor EP1 subtype
Ligand
BDBM50410087
Substrate
Meas. Tech.
ChEMBL_302785 (CHEMBL839470)
Ki
8±n/a nM
Citation
 Ducharme, YBlouin, MCarrière, MCChateauneuf, ACôté, BDenis, DFrenette, RGreig, GKargman, SLamontagne, SMartins, ENantel, FO'Neill, GSawyer, NMetters, KMFriesen, RW 2,3-Diarylthiophenes as selective EP1 receptor antagonists. Bioorg Med Chem Lett 15:1155-60 (2005)  
Target
Name:
Prostaglandin E2 receptor EP1 subtype
Synonyms:
PE2R1_HUMAN PTGER1 Prostaglandin E2 receptor EP1 subtype Prostanoid EP1 receptor
Type:
Enzyme
Mol. Mass.:
41834.57
Organism:
Homo sapiens (Human)
Description:
P34995
Residue:
402
  
Inhibitor
Name:
BDBM50410087
Synonyms:
CHEMBL2113029
Type:
Small organic molecule
Emp. Form.:
C23H18ClNO3S2
Mol. Mass.:
455.977
SMILES:
NS(=O)(=O)c1cccc(c1)-c1ccsc1-c1cc(Cl)ccc1OCc1ccccc1
: