Target
Melanin-concentrating hormone receptor 2
Ligand
BDBM50164244
Substrate
Meas. Tech.
ChEMBL_302592 (CHEMBL839552)
Ki
>3000±n/a nM
Citation
 McBriar, MDGuzik, HXu, RParuchova, JLi, SPalani, AClader, JWGreenlee, WJHawes, BEKowalski, TJO'Neill, KSpar, BWeig, B Discovery of bicycloalkyl urea melanin concentrating hormone receptor antagonists: orally efficacious antiobesity therapeutics. J Med Chem 48:2274-7 (2005)  
Target
Name:
Melanin-concentrating hormone receptor 2
Synonyms:
GPR145 MCHR2_HUMAN Melanin-concentrating hormone receptor SLT
Type:
Enzyme Catalytic Domain
Mol. Mass.:
38862.16
Organism:
Homo sapiens (Human)
Description:
Melanin Concentrating Hormone 2 GPR145 HUMAN::Q969V1
Residue:
340
  
Inhibitor
Name:
BDBM50164244
Synonyms:
3-(3-Chloro-4-fluoro-phenyl)-1-[4-(3-cyano-phenyl)-cyclohex-3-enyl]-1-(2-pyrrolidin-1-yl-ethyl)-urea | CHEMBL190875
Type:
Small organic molecule
Emp. Form.:
C26H28ClFN4O
Mol. Mass.:
466.978
SMILES:
Fc1ccc(NC(=O)N(CCN2CCCC2)C2CCC(=CC2)c2cccc(c2)C#N)cc1Cl
: