Target
Prostaglandin E2 receptor EP4 subtype
Ligand
BDBM50165948
Substrate
Meas. Tech.
ChEMBL_302462 (CHEMBL826328)
Ki
5.1±n/a nM
Citation
 Hattori, KTanaka, AFujii, NTakasugi, HTenda, YTomita, MNakazato, SNakano, KKato, YKono, YMurai, HSakane, K Discovery of diphenyloxazole and Ndelta-Z-ornithine derivatives as highly potent and selective human prostaglandin EP(4) receptor antagonists. J Med Chem 48:3103-6 (2005)  
Target
Name:
Prostaglandin E2 receptor EP4 subtype
Synonyms:
PE2R4_RAT Ptger4
Type:
PROTEIN
Mol. Mass.:
53381.95
Organism:
Rattus norvegicus
Description:
ChEMBL_1290039
Residue:
488
  
Inhibitor
Name:
BDBM50165948
Synonyms:
6-{(S)-2-[(Benzofuran-2-carbonyl)-amino]-5-benzyloxycarbonylamino-pentanoylamino}-hexanoic acid | CHEMBL192729
Type:
Small organic molecule
Emp. Form.:
C28H33N3O7
Mol. Mass.:
523.5775
SMILES:
OC(=O)CCCCCNC(=O)[C@H](CCCNC(=O)OCc1ccccc1)NC(=O)c1cc2ccccc2o1
: