Target
Prostaglandin E2 receptor EP4 subtype
Ligand
BDBM50165951
Substrate
Meas. Tech.
ChEMBL_303062 (CHEMBL828888)
Ki
8.4±n/a nM
Citation
 Hattori, KTanaka, AFujii, NTakasugi, HTenda, YTomita, MNakazato, SNakano, KKato, YKono, YMurai, HSakane, K Discovery of diphenyloxazole and Ndelta-Z-ornithine derivatives as highly potent and selective human prostaglandin EP(4) receptor antagonists. J Med Chem 48:3103-6 (2005)  
Target
Name:
Prostaglandin E2 receptor EP4 subtype
Synonyms:
PE2R4_HUMAN PGE2 receptor EP4 subtype PTGER4 Prostanoid EP4 receptor
Type:
Enzyme
Mol. Mass.:
53134.53
Organism:
Homo sapiens (Human)
Description:
P35408
Residue:
488
  
Inhibitor
Name:
BDBM50165951
Synonyms:
6-{(S)-2-[(Benzofuran-2-carbonyl)-amino]-6-benzyloxycarbonylamino-hexanoylamino}-hexanoic acid | CHEMBL190185
Type:
Small organic molecule
Emp. Form.:
C29H35N3O7
Mol. Mass.:
537.6041
SMILES:
OC(=O)CCCCCNC(=O)[C@H](CCCCNC(=O)OCc1ccccc1)NC(=O)c1cc2ccccc2o1
: