Target
Cytochrome P450 2D6
Ligand
BDBM50007344
Substrate
Meas. Tech.
ChEMBL_306014 (CHEMBL874551)
IC50
26±n/a nM
Citation
 Le Bourdonnec, BAjello, CWSeida, PRSusnow, RGCassel, JABelanger, SStabley, GJDeHaven, RNDeHaven-Hudkins, DLDolle, RE Arylacetamide kappa opioid receptor agonists with reduced cytochrome P450 2D6 inhibitory activity. Bioorg Med Chem Lett 15:2647-52 (2005)  
Target
Name:
Cytochrome P450 2D6
Synonyms:
CP2D6_HUMAN CYP2DL1 Cytochrome P450 2D6 (CYP2D6) P450-DB1
Type:
Protein
Mol. Mass.:
55774.82
Organism:
Homo sapiens (Human)
Description:
P10635
Residue:
497
  
Inhibitor
Name:
BDBM50007344
Synonyms:
(S)-2-(3,4-Dichloro-phenyl)-N-methyl-N-(1-phenyl-2-pyrrolidin-1-yl-ethyl)-acetamide(ICI 199441) 2-(3,4-Dichloro-phenyl)-N-methyl-N-((S)-1-phenyl-2-pyrrolidin-1-yl-ethyl)-acetamide CHEMBL38576 | ICI-199441
Type:
Small organic molecule
Emp. Form.:
C21H24Cl2N2O
Mol. Mass.:
391.334
SMILES:
CN([C@H](CN1CCCC1)c1ccccc1)C(=O)Cc1ccc(Cl)c(Cl)c1
: