Target
Transient receptor potential cation channel subfamily V member 1
Ligand
BDBM20330
Substrate
Meas. Tech.
ChEMBL_302360 (CHEMBL828079)
Ki
3.4±n/a nM
Citation
 Lee, JKang, SUKil, MJShin, MLim, JOChoi, HKJin, MKKim, SYKim, SELee, YSMin, KHKim, YHHa, HJTran, RWelter, JDWang, YSzabo, TPearce, LVLundberg, DJToth, APavlyukovets, VAMorgan, MABlumberg, PM Analysis of structure-activity relationships for the 'A-region' of N-(4-t-butylbenzyl)-N'-[4-(methylsulfonylamino)benzyl]thiourea analogues as TRPV1 antagonists. Bioorg Med Chem Lett 15:4136-42 (2005)  
Target
Name:
Transient receptor potential cation channel subfamily V member 1
Synonyms:
Capsaicin receptor TRPV1_RAT Trpv1 Vanilloid VR1 Vanilloid receptor 1 (VRI/TRPV1) Vanilloid receptor type 1-like (TrpV1/Vr1) Vr1l | osm-9-like TRP channel 1
Type:
Transient Receptor
Mol. Mass.:
94956.12
Organism:
Rattus norvegicus (rat)
Description:
O35433
Residue:
838
  
Inhibitor
Name:
BDBM20330
Synonyms:
3-[(4-tert-butylphenyl)methyl]-1-[(4-methanesulfonamido-3-methoxyphenyl)methyl]thiourea thiourea analogue, 3
Type:
Small organic molecule
Emp. Form.:
C21H29N3O3S2
Mol. Mass.:
435.603
SMILES:
COc1cc(CNC(=S)NCc2ccc(cc2)C(C)(C)C)ccc1NS(C)(=O)=O
: