Target
Adenosine receptor A1
Ligand
BDBM50170823
Substrate
Meas. Tech.
ChEMBL_303144 (CHEMBL829118)
Ki
3900±n/a nM
Citation
 Perreira, MJiang, JKKlutz, AMGao, ZGShainberg, ALu, CThomas, CJJacobson, KA "Reversine" and its 2-substituted adenine derivatives as potent and selective A3 adenosine receptor antagonists. J Med Chem 48:4910-8 (2005)  
Target
Name:
Adenosine receptor A1
Synonyms:
A1 adenosine receptor (hA1) AA1R_HUMAN ADORA1 Adenosine A1-receptor Adenosine receptor A1 (hA1) | Adenosine transporter (AdT)
Type:
G Protein-Coupled Receptor (GPCR)
Mol. Mass.:
36520.92
Organism:
Homo sapiens (Human)
Description:
P30542
Residue:
326
  
Inhibitor
Name:
BDBM50170823
Synonyms:
CHEMBL366216 | N*6*-Cyclohexyl-N*2*-(4-dimethylamino-phenyl)-9H-purine-2,6-diamine
Type:
Small organic molecule
Emp. Form.:
C19H25N7
Mol. Mass.:
351.4487
SMILES:
CN(C)c1ccc(Nc2nc(NC3CCCCC3)c3[nH]cnc3n2)cc1
: